{"text_format":"1","workbook":"xlsx","n_sheets":13,"sheets":["Vertiga Hybrid","data","NL","EN","FR","DE","NR","SP","SW","TS","ExtraTaal1","ExtraTaal2","ExtraTaal3"],"not_rendered":{"charts":0,"images":5,"macros":1,"external_links":0,"defined_names":0,"comments":0,"pivot_tables":0},"unopened":[],"bounds":{"document_bytes":16777216,"sheet_cells":100000,"rows_first":2000,"rows_last":500,"rows_between":2000,"halvings":0,"cell_chars":16384,"cell_head_chars":4096},"cells_cut":0,"cells_raw":0,"read":"whole","date_system":"1900"}

{"sheet":"Vertiga Hybrid","index":0,"n_rows":24,"n_cols":13,"rows_kept":24,"cut":false,"hidden":false,"merged":[[1,1,1,10],[15,7,15,8],[10,11,13,12],[11,1,11,3],[11,6,11,8],[9,1,9,3],[9,6,9,8],[10,1,10,3],[10,6,10,8],[9,11,9,12],[12,6,12,8],[5,5,5,8],[3,5,3,8],[3,9,3,10],[6,12,7,12],[6,11,7,11],[4,9,4,10],[4,5,4,8],[19,7,19,8],[18,7,18,8],[17,7,17,8],[22,2,23,12],[16,1,16,12],[17,5,18,5],[6,10,7,10],[6,9,7,9]]}
[]
[null,"Selectiontool Vertiga Hybrid"]
[]
[null,null,null,null,null,"Taal/Language/Sprache/Språk/Jazyk",null,null,null,"English"]
[null,null,null,null,null,{"$f":"IF(data!$P$38=1,\"Type omkasting\",IF(data!$P$38=2,\"Case type\",IF(data!$P$38=3,\"Gehäusetyp\",IF(data!$P$38=4,\"Type de boîtier\",IF(data!$P$38=5,\"Foringsrør type\",IF(data!$P$38=6,\"Tipo de carcasa\",IF(data!$P$38=7,\"Typ av hölje\",IF(data!$P$38=8,\"Typ krytu\"))))))))","v":"Case type"},null,null,null,"Primo"]
[null,null,null,null,null,{"$f":"IF(data!$P$38=1,\"Uitvoering\",IF(data!$P$38=2,\"Version\",IF(data!$P$38=3,\"Ausfürhung\",IF(data!$P$38=4,\"Version\",IF(data!$P$38=5,\"Versjon\",IF(data!$P$38=6,\"Versión\",IF(data!$P$38=7,\"Prestanda\",IF(data!$P$38=8,\"Verze\"))))))))","v":"Version"},null,null,null,52,200,8,{"$f":"data!E5","v":9.1999999999999993}]
[null,null,null,null,null,null,null,null,null,{"$f":"IF(data!$P$38=1,NL!B3,IF(data!$P$38=2,EN!B3,IF(data!$P$38=4,FR!B3,IF(data!$P$38=3,DE!B3,IF(data!$P$38=5,NR!B3,IF(data!$P$38=6,SP!B3,IF(data!$P$38=7,SW!B3,IF(data!$P$38=8,TS!B3,))))))))","v":"Length"},{"$f":"IF(data!$P$38=1,NL!B4,IF(data!$P$38=2,EN!B4,IF(data!$P$38=4,FR!B4,IF(data!$P$38=3,DE!B4,IF(data!$P$38=5,NR!B4,IF(data!$P$38=6,SP!B4,IF(data!$P$38=7,SW!B4,IF(data!$P$38=8,TS!B4,))))))))","v":"Heigth"},{"$f":"IF(data!$P$38=1,NL!B5,IF(data!$P$38=2,EN!B5,IF(data!$P$38=4,FR!B5,IF(data!$P$38=3,DE!B5,IF(data!$P$38=5,NR!B5,IF(data!$P$38=6,SP!B5,IF(data!$P$38=7,SW!B5,IF(data!$P$38=8,TS!B5,))))))))","v":"Type"},{"$f":"IF(data!$P$38=1,NL!B6,IF(data!$P$38=2,EN!B6,IF(data!$P$38=4,FR!B6,IF(data!$P$38=3,DE!B6,IF(data!$P$38=5,NR!B6,IF(data!$P$38=6,SP!B6,IF(data!$P$38=7,SW!B6,IF(data!$P$38=8,TS!B6,))))))))","v":"Depth"}]
[null,{"$f":"IF(data!$P$38=1,NL!E5,IF(data!$P$38=2,EN!E5,IF(data!$P$38=4,FR!E5,IF(data!$P$38=3,DE!E5,IF(data!$P$38=5,NR!E5,IF(data!$P$38=6,SP!E5,IF(data!$P$38=7,SW!E5,IF(data!$P$38=8,TS!E5,))))))))","v":"Temperatures"}]
[null,{"$f":"IF(data!$P$38=1,NL!B8,IF(data!$P$38=2,EN!B8,IF(data!$P$38=4,FR!B8,IF(data!$P$38=3,DE!B8,IF(data!$P$38=5,NR!B8,IF(data!$P$38=6,SP!B8,IF(data!$P$38=7,SW!B8,IF(data!$P$38=8,TS!B8,))))))))","v":"Heating:"},null,null,null,null,{"$f":"IF(data!$P$38=1,NL!G8,IF(data!$P$38=2,EN!G8,IF(data!$P$38=4,FR!G8,IF(data!$P$38=3,DE!G8,IF(data!$P$38=5,NR!G8,IF(data!$P$38=6,SP!G8,IF(data!$P$38=7,SW!G8,IF(data!$P$38=8,TS!G8,))))))))","v":"Cooling:"}]
[null,{"$f":"IF(data!$P$38=1,NL!B9,IF(data!$P$38=2,EN!B9,IF(data!$P$38=4,FR!B9,IF(data!$P$38=3,DE!B9,IF(data!$P$38=5,NR!B9,IF(data!$P$38=6,SP!B9,IF(data!$P$38=7,SW!B9,IF(data!$P$38=8,TS!B9,))))))))","v":"Supply water"},0,0,60,{"$f":"IF(data!$R$31=1,\"°C\",IF(data!$R$31=2,\"°F\",))","v":"°C"},{"$f":"B10","v":"Supply water"},0,0,15.999999999999998,{"$f":"F10","v":"°C"},{"$f":"IF(data!$P$38=1,NL!G4,IF(data!$P$38=2,EN!G4,IF(data!$P$38=4,FR!G4,IF(data!$P$38=3,DE!G4,IF(data!$P$38=5,NR!G4,IF(data!$P$38=6,SP!G4,IF(data!$P$38=7,SW!G4,IF(data!$P$38=8,TS!G4,))))))))","v":"Unit conversion"}]
[null,{"$f":"IF(data!$P$38=1,NL!B10,IF(data!$P$38=2,EN!B10,IF(data!$P$38=4,FR!B10,IF(data!$P$38=3,DE!B10,IF(data!$P$38=5,NR!B10,IF(data!$P$38=6,SP!B10,IF(data!$P$38=7,SW!B10,IF(data!$P$38=8,TS!B10,))))))))","v":"Return water"},0,0,40,{"$f":"F10","v":"°C"},{"$f":"B11","v":"Return water"},0,0,18.000000000000004,{"$f":"F10","v":"°C"}]
[null,{"$f":"IF(data!$P$38=1,NL!B11,IF(data!$P$38=2,EN!B11,IF(data!$P$38=4,FR!B11,IF(data!$P$38=3,DE!B11,IF(data!$P$38=5,NR!B11,IF(data!$P$38=6,SP!B11,IF(data!$P$38=7,SW!B11,IF(data!$P$38=8,TS!B11,))))))))","v":"Entering air (dry bulb)"},0,0,20,{"$f":"F10","v":"°C"},{"$f":"B12","v":"Entering air (dry bulb)"},0,0,28.000000000000004,{"$f":"F10","v":"°C"}]
[null,null,null,null,null,null,{"$f":"IF(data!$P$38=1,NL!$G$3,IF(data!$P$38=2,EN!$G$3,IF(data!$P$38=4,FR!$G$3,IF(data!$P$38=3,DE!$G$3,IF(data!$P$38=5,NR!$G$3,IF(data!$P$38=6,SP!$G$3,IF(data!$P$38=7,SW!$G$3,IF(data!$P$38=8,TS!$G$3,))))))))","v":"rel. humid."},null,null,0.5]
[]
[]
[null,{"$f":"IF(data!$P$38=1,NL!B16,IF(data!$P$38=2,EN!B16,IF(data!$P$38=4,FR!B16,IF(data!$P$38=3,DE!B16,IF(data!$P$38=5,NR!B16,IF(data!$P$38=6,SP!B16,IF(data!$P$38=7,SW!B16,IF(data!$P$38=8,TS!B16,))))))))","v":"Fan speed"},{"$f":"IF(data!$P$38=1,NL!B19,IF(data!$P$38=2,EN!B19,IF(data!$P$38=4,FR!B19,IF(data!$P$38=3,DE!B19,IF(data!$P$38=5,NR!B19,IF(data!$P$38=6,SP!B19,IF(data!$P$38=7,SW!B19,IF(data!$P$38=8,TS!B19,))))))))","v":"Fan voltage [V]"},{"$f":"IF(data!$P$38=1,NL!C14,IF(data!$P$38=2,EN!C14,IF(data!$P$38=4,FR!C14,IF(data!$P$38=3,DE!C14,IF(data!$P$38=5,NR!C14,IF(data!$P$38=6,SP!C14,IF(data!$P$38=7,SW!C14,IF(data!$P$38=8,TS!C14,))))))))&IF(data!$R$31=1,\" [W]\",IF(data!$R$31=2,\" [Btu/h]\",))","v":"Heating capacity [W]"},{"$f":"IF(data!$P$38=1,NL!D14,IF(data!$P$38=2,EN!D14,IF(data!$P$38=4,FR!D14,IF(data!$P$38=3,DE!D14,IF(data!$P$38=5,NR!D14,IF(data!$P$38=6,SP!D14,IF(data!$P$38=7,SW!D14,IF(data!$P$38=8,TS!D14,))))))))&IF(data!$R$31=1,\" [kg/u]\",IF(data!$R$31=2,\" [GPM]**\",))","v":"Water flow [kg/u]"},null,{"$f":"IF(data!$P$38=1,NL!E14,IF(data!$P$38=2,EN!E14,IF(data!$P$38=4,FR!E14,IF(data!$P$38=3,DE!E14,IF(data!$P$38=5,NR!E14,IF(data!$P$38=6,SP!E14,IF(data!$P$38=7,SW!E14,IF(data!$P$38=8,TS!E14,))))))))&IF(data!$R$31=1,\" [W]\",IF(data!$R$31=2,\" [Btu/h]\",))","v":"Cooling capacity [W]"},{"$f":"E16","v":"Water flow [kg/u]"},null,{"$f":"IF(data!$P$38=1,NL!I13,IF(data!$P$38=2,EN!I13,IF(data!$P$38=4,FR!I13,IF(data!$P$38=3,DE!I13,IF(data!$P$38=5,NR!I13,IF(data!$P$38=6,SP!I13,IF(data!$P$38=7,SW!I13,IF(data!$P$38=8,TS!I13,))))))))","v":"Sound pressure level [dB(A)]****"},{"$f":"IF(data!$P$38=1,NL!J13,IF(data!$P$38=2,EN!J13,IF(data!$P$38=4,FR!J13,IF(data!$P$38=3,DE!J13,IF(data!$P$38=5,NR!J13,IF(data!$P$38=6,SP!J13,IF(data!$P$38=7,SW!J13,IF(data!$P$38=8,TS!J13,))))))))","v":"Sound power [dB(A)]****"},{"$f":"IF(data!$P$38=1,NL!H13,IF(data!$P$38=2,EN!H13,IF(data!$P$38=4,FR!H13,IF(data!$P$38=3,DE!H13,IF(data!$P$38=5,NR!H13,IF(data!$P$38=6,SP!H13,IF(data!$P$38=7,SW!H13,IF(data!$P$38=8,TS!H13,))))))))","v":"Electrical consumption [W]"},{"$f":"IF(data!$P$38=1,NL!G13,IF(data!$P$38=2,EN!G13,IF(data!$P$38=4,FR!G13,IF(data!$P$38=3,DE!G13,IF(data!$P$38=5,NR!G13,IF(data!$P$38=6,SP!G13,IF(data!$P$38=7,SW!G13,IF(data!$P$38=8,TS!G13,))))))))&\" [l]\"","v":"Water volume [l]"}]
[null,{"$f":"CONCATENATE(\"Vertiga Hybrid, \",J7, \" \",J6, \"cm, \",K7, \" \",K6,\"cm, \",L7, \" \",L6)","v":"Vertiga Hybrid, Length 52cm, Heigth 200cm, Type 8"},0,0,0,0,0,0,0,0,0,0,0]
[null,1,{"$f":"data!AR5","v":"N/A"},{"$f":"ROUND(IF(data!$R$31=1,data!S5,IF(data!$R$31=2,data!S5*3.412141633,)),0)","v":827},{"$f":"IF(data!$R$31=1,ROUND(data!W5,0),IF(data!$R$31=2,ROUND(data!W5/272.7654,1),))","v":36},null,{"$f":"IF(data!BF5=1,ROUND(IF(data!$R$31=1,data!AF5,IF(data!$R$31=2,data!AF5*3.412141633,)),0),\"\")","v":165},{"$f":"IF(data!BF5=1,IF(data!$R$31=1,ROUND(data!AI5,0),IF(data!$R$31=2,ROUND(data!AI5/272.7654,1),)),\"\")","v":71},null,{"$f":"data!G5","v":26},{"$f":"J18+8","v":34},{"$f":"data!AM5","v":"N/A"},{"$f":"IF(data!$R$31=1,data!AL$5,IF(data!$R$31=2,data!AL$5/4.54609,))","v":1.4}]
[null,2,{"$f":"data!AS5","v":"N/A"},{"$f":"ROUND(IF(data!$R$31=1,data!T5,IF(data!$R$31=2,data!T5*3.412141633,)),0)","v":946},{"$f":"IF(data!$R$31=1,ROUND(data!X5,0),IF(data!$R$31=2,ROUND(data!X5/272.7654,1),))","v":41},null,{"$f":"IF(data!BF5=1,ROUND(IF(data!$R$31=1,data!AG5,IF(data!$R$31=2,data!AG5*3.412141633,)),0),\"\")","v":197},{"$f":"IF(data!BF5=1,IF(data!$R$31=1,ROUND(data!AJ5,0),IF(data!$R$31=2,ROUND(data!AJ5/272.7654,1),)),\"\")","v":85},null,{"$f":"data!H5","v":30},{"$f":"J19+8","v":38},{"$f":"data!AN5","v":"N/A"},{"$f":"IF(data!$R$31=1,data!AL$5,IF(data!$R$31=2,data!AL$5/4.54609,))","v":1.4}]
[null,3,{"$f":"data!AT5","v":"N/A"},{"$f":"ROUND(IF(data!$R$31=1,data!U5,IF(data!$R$31=2,data!U5*3.412141633,)),0)","v":1325},{"$f":"IF(data!$R$31=1,ROUND(data!Y5,0),IF(data!$R$31=2,ROUND(data!Y5/272.7654,1),))","v":57},null,{"$f":"IF(data!BF5=1,ROUND(IF(data!$R$31=1,data!AH5,IF(data!$R$31=2,data!AH5*3.412141633,)),0),\"\")","v":260},{"$f":"IF(data!BF5=1,IF(data!$R$31=1,ROUND(data!AK5,0),IF(data!$R$31=2,ROUND(data!AK5/272.7654,1),)),\"\")","v":112},null,{"$f":"data!I5","v":36.6},{"$f":"J20+8","v":44.6},{"$f":"data!AO5","v":"N/A"},{"$f":"IF(data!$R$31=1,data!AL$5,IF(data!$R$31=2,data!AL$5/4.54609,))","v":1.4}]
[null,"*",{"$f":"IF(data!$P$38=1,NL!B20,IF(data!$P$38=2,EN!B20,IF(data!$P$38=4,FR!B20,IF(data!$P$38=3,DE!B20,IF(data!$P$38=5,NR!B20,IF(data!$P$38=6,SP!B20,IF(data!$P$38=7,SW!B20,IF(data!$P$38=8,TS!B20,))))))))","v":"Cooling power is calcullated according EN16430 with fans blowing up for all heights."},null,null,null,null,null,null,null,null,null,"v2021-05-08"]
[null,"**",{"$f":"IF(data!$P$38=1,NL!B21,IF(data!$P$38=2,EN!B21,IF(data!$P$38=4,FR!B21,IF(data!$P$38=3,DE!B21,IF(data!$P$38=5,NR!B21,IF(data!$P$38=6,SP!B21,IF(data!$P$38=7,SW!B21,IF(data!$P$38=8,TS!B21,))))))))","v":"When the water volume is given in gallons, the units are specifically imperial gallons."}]
[null,"***",{"$f":"IF(data!$P$38=1,NL!B22,IF(data!$P$38=2,EN!B22,IF(data!$P$38=4,FR!B22,IF(data!$P$38=3,DE!B22,IF(data!$P$38=5,NR!B22,IF(data!$P$38=6,SP!B22,IF(data!$P$38=7,SW!B22,IF(data!$P$38=8,TS!B22,))))))))","v":"Soundpower according to ISO 3741:2010, sound pressure level with assumed room damping of 8 dB(A)."},{"$f":"IF(data!$P$38=1,NL!C22,IF(data!$P$38=2,EN!C22,IF(data!$P$38=4,FR!C22,IF(data!$P$38=3,DE!C22,IF(data!$P$38=5,NR!C22,IF(data!$P$38=6,SP!C22,))))))","v":0},{"$f":"IF(data!$P$38=1,NL!D22,IF(data!$P$38=2,EN!D22,IF(data!$P$38=4,FR!D22,IF(data!$P$38=3,DE!D22,IF(data!$P$38=5,NR!D22,IF(data!$P$38=6,SP!D22,))))))","v":0},{"$f":"IF(data!$P$38=1,NL!E22,IF(data!$P$38=2,EN!E22,IF(data!$P$38=4,FR!E22,IF(data!$P$38=3,DE!E22,IF(data!$P$38=5,NR!E22,IF(data!$P$38=6,SP!E22,))))))","v":0},{"$f":"IF(data!$P$38=1,NL!F22,IF(data!$P$38=2,EN!F22,IF(data!$P$38=4,FR!F22,IF(data!$P$38=3,DE!F22,IF(data!$P$38=5,NR!F22,IF(data!$P$38=6,SP!F22,))))))","v":0},{"$f":"IF(data!$P$38=1,NL!G22,IF(data!$P$38=2,EN!G22,IF(data!$P$38=4,FR!G22,IF(data!$P$38=3,DE!G22,IF(data!$P$38=5,NR!G22,IF(data!$P$38=6,SP!G22,))))))","v":0},{"$f":"IF(data!$P$38=1,NL!H22,IF(data!$P$38=2,EN!H22,IF(data!$P$38=4,FR!H22,IF(data!$P$38=3,DE!H22,IF(data!$P$38=5,NR!H22,IF(data!$P$38=6,SP!H22,))))))","v":0},{"$f":"IF(data!$P$38=1,NL!I22,IF(data!$P$38=2,EN!I22,IF(data!$P$38=4,FR!I22,IF(data!$P$38=3,DE!I22,IF(data!$P$38=5,NR!I22,IF(data!$P$38=6,SP!I22,))))))","v":0},{"$f":"IF(data!$P$38=1,NL!J22,IF(data!$P$38=2,EN!J22,IF(data!$P$38=4,FR!J22,IF(data!$P$38=3,DE!J22,IF(data!$P$38=5,NR!J22,IF(data!$P$38=6,SP!J22,))))))","v":0},{"$f":"IF(data!$P$38=1,NL!K22,IF(data!$P$38=2,EN!K22,IF(data!$P$38=4,FR!K22,IF(data!$P$38=3,DE!K22,IF(data!$P$38=5,NR!K22,IF(data!$P$38=6,SP!K22,))))))","v":0},{"$f":"IF(data!$P$38=1,NL!L22,IF(data!$P$38=2,EN!L22,IF(data!$P$38=4,FR!L22,IF(data!$P$38=3,DE!L22,IF(data!$P$38=5,NR!L22,IF(data!$P$38=6,SP!L22,))))))","v":0}]
[null,null,{"$f":"IF(data!$P$38=1,NL!B23,IF(data!$P$38=2,EN!B23,IF(data!$P$38=4,FR!B23,IF(data!$P$38=3,DE!B23,IF(data!$P$38=5,NR!B23,IF(data!$P$38=6,SP!B23,))))))","v":0},{"$f":"IF(data!$P$38=1,NL!C23,IF(data!$P$38=2,EN!C23,IF(data!$P$38=4,FR!C23,IF(data!$P$38=3,DE!C23,IF(data!$P$38=5,NR!C23,IF(data!$P$38=6,SP!C23,))))))","v":0},{"$f":"IF(data!$P$38=1,NL!D23,IF(data!$P$38=2,EN!D23,IF(data!$P$38=4,FR!D23,IF(data!$P$38=3,DE!D23,IF(data!$P$38=5,NR!D23,IF(data!$P$38=6,SP!D23,))))))","v":0},{"$f":"IF(data!$P$38=1,NL!E23,IF(data!$P$38=2,EN!E23,IF(data!$P$38=4,FR!E23,IF(data!$P$38=3,DE!E23,IF(data!$P$38=5,NR!E23,IF(data!$P$38=6,SP!E23,))))))","v":0},{"$f":"IF(data!$P$38=1,NL!F23,IF(data!$P$38=2,EN!F23,IF(data!$P$38=4,FR!F23,IF(data!$P$38=3,DE!F23,IF(data!$P$38=5,NR!F23,IF(data!$P$38=6,SP!F23,))))))","v":0},{"$f":"IF(data!$P$38=1,NL!G23,IF(data!$P$38=2,EN!G23,IF(data!$P$38=4,FR!G23,IF(data!$P$38=3,DE!G23,IF(data!$P$38=5,NR!G23,IF(data!$P$38=6,SP!G23,))))))","v":0},{"$f":"IF(data!$P$38=1,NL!H23,IF(data!$P$38=2,EN!H23,IF(data!$P$38=4,FR!H23,IF(data!$P$38=3,DE!H23,IF(data!$P$38=5,NR!H23,IF(data!$P$38=6,SP!H23,))))))","v":0},{"$f":"IF(data!$P$38=1,NL!I23,IF(data!$P$38=2,EN!I23,IF(data!$P$38=4,FR!I23,IF(data!$P$38=3,DE!I23,IF(data!$P$38=5,NR!I23,IF(data!$P$38=6,SP!I23,))))))","v":0},{"$f":"IF(data!$P$38=1,NL!J23,IF(data!$P$38=2,EN!J23,IF(data!$P$38=4,FR!J23,IF(data!$P$38=3,DE!J23,IF(data!$P$38=5,NR!J23,IF(data!$P$38=6,SP!J23,))))))","v":0},{"$f":"IF(data!$P$38=1,NL!K23,IF(data!$P$38=2,EN!K23,IF(data!$P$38=4,FR!K23,IF(data!$P$38=3,DE!K23,IF(data!$P$38=5,NR!K23,IF(data!$P$38=6,SP!K23,))))))","v":0},{"$f":"IF(data!$P$38=1,NL!L23,IF(data!$P$38=2,EN!L23,IF(data!$P$38=4,FR!L23,IF(data!$P$38=3,DE!L23,IF(data!$P$38=5,NR!L23,IF(data!$P$38=6,SP!L23,))))))","v":0}]

{"sheet":"data","index":1,"n_rows":38,"n_cols":58,"rows_kept":38,"cut":false,"hidden":true,"merged":[[6,47,6,49],[6,50,6,52],[6,54,6,56],[6,57,6,58]]}
[null,null,null,null,null,null,null,null,null,"heating","Ti",{"$f":"IF($R$31=1,$M1,IF($R$31=2,(M1-32)/1.8,))","v":60},{"$f":"'Vertiga Hybrid'!E10","v":60},null,null,null,null,null,null,null,null,null,null,null,null,"cooling","Ti",{"$f":"IF($R$31=1,$AC1,IF($R$31=2,($AC1-32)/1.8,))","v":15.999999999999998},{"$f":"'Vertiga Hybrid'!J10","v":15.999999999999998},null,"RH",{"$f":"'Vertiga Hybrid'!J13","v":0.5}]
[null,null,null,null,null,null,null,null,null,null,"Tr",{"$f":"IF($R$31=1,$M2,IF($R$31=2,(M2-32)/1.8,))","v":40},{"$f":"'Vertiga Hybrid'!E11","v":40},null,null,null,null,null,null,null,null,null,null,null,null,null,"Tr",{"$f":"IF($R$31=1,$AC2,IF($R$31=2,($AC2-32)/1.8,))","v":18.000000000000004},{"$f":"'Vertiga Hybrid'!J11","v":18.000000000000004}]
[null,null,null,null,null,null,null,null,null,null,"Ta",{"$f":"IF($R$31=1,$M3,IF($R$31=2,(M3-32)/1.8,))","v":20},{"$f":"'Vertiga Hybrid'!E12","v":20},null,null,null,null,null,null,null,null,null,null,null,null,null,"Ta",{"$f":"IF($R$31=1,$AC3,IF($R$31=2,($AC3-32)/1.8,))","v":28.000000000000004},{"$f":"'Vertiga Hybrid'!J12","v":28.000000000000004}]
["kolomindex",2,3,4,5,6,7,8,9,10,11,12,13,14,15,16,17,18,19,20,21,22,23,24,25,26,27,28,29,30,31,32,33,34,35,36,37,38,39,40,41,42,43,44,45,46,47,48,49,50,51,52,53,54,55,56,57,58]
[{"$f":"CONCATENATE('Vertiga Hybrid'!K6,'Vertiga Hybrid'!J6,'Vertiga Hybrid'!L6)","v":"200528"},{"$f":"VLOOKUP($A$5,$A$9:$BF$14,B4,0)","v":200},52,8,9.1999999999999993,0,26,30,36.6,0,1428,1633,2289,0,1,1,1,0,827,946,1325,0,36,41,57,151,180,237,0.95,0.95,0.95,165,197,260,71,85,112,1.4,"N/A","N/A","N/A",{"$f":"VLOOKUP($A$5,$A$9:$BF$14,AP4,0)","v":0},0,{"$f":"VLOOKUP($A$5,$A$9:$BF$14,AR4,0)","v":"N/A"},"N/A","N/A",0,1,1,1,165,197,260,0,0,0,0,{"$f":"VLOOKUP($A$5,$A$9:$BF$14,BF4,0)","v":1}]
[]
[null,null,null,null,null,"soundpressure level",null,null,null,"power","75/65/20",null,null,"n",null,null,null,"result","power",null,null,"result","flow",null,null,"power","16/18/27",null,"n",null,null,"result","power",null,"result","flow",null,null,"electrical power nominal",null,null,null,null,null,"BMS-stuurspanning",null,null,"Sensible heat factor",null,null,"Total cooling capacity",null,null,null,"Diff. Total and sensible",null,null,"Show or not"]
["lookup code","height","length","type","depth",0,1,2,3,0,1,2,3,0,1,2,3,0,1,2,3,0,1,2,3,1,2,3,1,2,3,1,2,3,1,2,3,"watervolume",1,2,3,null,0,1,2,3,null,"SHF 1","SHF 2","SHF 3","Q,t 1","Q,t 2","Q,t 3",null,"ΔQ,t,s 1","ΔQ,t,s 2","ΔQ,t,s 3","OK/NOTOK"]
[{"$f":"CONCATENATE(B9,C9,D9)","v":"200418"},200,41,8,{"$f":"IF('Vertiga Hybrid'!$J$5=data!$K$20,9.2,IF('Vertiga Hybrid'!$J$5=data!$K$21,11.5,\"\"))","v":9.1999999999999993},0,26,30,33.299999999999997,0,1315,1449,1620,0,1,1,1,{"$f":"ROUND(J9*POWER((($L$1-$L$2)/LN(($L$1-$L$3)/($L$2-$L$3)))/((75-65)/LN((75-20)/(65-20))),N9),0)","v":0},{"$f":"ROUND(K9*POWER((($L$1-$L$2)/LN(($L$1-$L$3)/($L$2-$L$3)))/((75-65)/LN((75-20)/(65-20))),O9),0)","v":761},{"$f":"ROUND(L9*POWER((($L$1-$L$2)/LN(($L$1-$L$3)/($L$2-$L$3)))/((75-65)/LN((75-20)/(65-20))),P9),0)","v":839},{"$f":"ROUND(M9*POWER((($L$1-$L$2)/LN(($L$1-$L$3)/($L$2-$L$3)))/((75-65)/LN((75-20)/(65-20))),Q9),0)","v":938},{"$f":"ROUND(R9*3600/(4186*ABS($L$1-$L$2)),0)","v":0},{"$f":"ROUND(S9*3600/(4186*ABS($L$1-$L$2)),0)","v":33},{"$f":"ROUND(T9*3600/(4186*ABS($L$1-$L$2)),0)","v":36},{"$f":"ROUND(U9*3600/(4186*ABS($L$1-$L$2)),0)","v":40},127,154,178,0.95,0.95,0.95,{"$f":"ROUND(Z9*POWER((($AB$1-$AB$2)/LN(($AB$1-$AB$3)/($AB$2-$AB$3)))/((16-18)/LN((16-27)/(18-27))),AC9),0)","v":139},169,{"$f":"ROUND(AB9*POWER((($AB$1-$AB$2)/LN(($AB$1-$AB$3)/($AB$2-$AB$3)))/((16-18)/LN((16-27)/(18-27))),AE9),0)","v":195},{"$f":"ROUND(AF9*3600/(4186*ABS($AB$1-$AB$2)),0)","v":60},{"$f":"ROUND(AG9*3600/(4186*ABS($AB$1-$AB$2)),0)","v":73},{"$f":"ROUND(AH9*3600/(4186*ABS($AB$1-$AB$2)),0)","v":84},1.4,"N/A","N/A","N/A",null,0,"N/A","N/A","N/A",null,{"$f":"IF(1/(1+((2258*((0.622/((101325/(1*611*EXP(17.27*((($AB$1+$AB$2)/2)/((($AB$1+$AB$2)/2)+237.3))))))-1)*1000-(0.622/((101325/($AF$1*611*EXP(17.27*($AB$3/($AB$3+237.3))))))-1)*1000))/(1005*((($AB$1+$AB$2)/2)-$AB$3))))>1,1,1/(1+((2258*((0.622/((101325/(1*611*EXP(17.27*((($AB$1+$AB$2)/2)/((($AB$1+$AB$2)/2)+237.3))))))-1)*1000-(0.622/((101325/($AF$1*611*EXP(17.27*($AB$3/($AB$3+237.3))))))-1)*1000))/(1005*((($AB$1+$AB$2)/2)-$AB$3)))))","v":1},{"$f":"IF(1/(1+((2258*((0.622/((101325/(1*611*EXP(17.27*((($AB$1+$AB$2)/2)/((($AB$1+$AB$2)/2)+237.3))))))-1)*1000-(0.622/((101325/($AF$1*611*EXP(17.27*($AB$3/($AB$3+237.3))))))-1)*1000))/(1005*((($AB$1+$AB$2)/2)-$AB$3))))>1,1,1/(1+((2258*((0.622/((101325/(1*611*EXP(17.27*((($AB$1+$AB$2)/2)/((($AB$1+$AB$2)/2)+237.3))))))-1)*1000-(0.622/((101325/($AF$1*611*EXP(17.27*($AB$3/($AB$3+237.3))))))-1)*1000))/(1005*((($AB$1+$AB$2)/2)-$AB$3)))))","v":1},{"$f":"IF(1/(1+((2258*((0.622/((101325/(1*611*EXP(17.27*((($AB$1+$AB$2)/2)/((($AB$1+$AB$2)/2)+237.3))))))-1)*1000-(0.622/((101325/($AF$1*611*EXP(17.27*($AB$3/($AB$3+237.3))))))-1)*1000))/(1005*((($AB$1+$AB$2)/2)-$AB$3))))>1,1,1/(1+((2258*((0.622/((101325/(1*611*EXP(17.27*((($AB$1+$AB$2)/2)/((($AB$1+$AB$2)/2)+237.3))))))-1)*1000-(0.622/((101325/($AF$1*611*EXP(17.27*($AB$3/($AB$3+237.3))))))-1)*1000))/(1005*((($AB$1+$AB$2)/2)-$AB$3)))))","v":1},{"$f":"AF9/AV9","v":139},169,195,null,{"$f":"AY9-AF9","v":0},0,0,{"$f":"IF(SUM(BC9:BE9)=0,1,0)","v":1}]
[{"$f":"CONCATENATE(B10,C10,D10)","v":"200528"},200,52,8,{"$f":"IF('Vertiga Hybrid'!$J$5=data!$K$20,9.2,IF('Vertiga Hybrid'!$J$5=data!$K$21,11.5,\"\"))","v":9.1999999999999993},0,26,30,36.6,0,1428,1633,2289,0,1,1,1,0,827,946,1325,0,36,41,57,151,180,237,0.95,0.95,0.95,165,197,{"$f":"ROUND(AB10*POWER((($AB$1-$AB$2)/LN(($AB$1-$AB$3)/($AB$2-$AB$3)))/((16-18)/LN((16-27)/(18-27))),AE10),0)","v":260},71,85,112,1.4,"N/A","N/A","N/A",null,0,"N/A","N/A","N/A",null,{"$f":"IF(1/(1+((2258*((0.622/((101325/(1*611*EXP(17.27*((($AB$1+$AB$2)/2)/((($AB$1+$AB$2)/2)+237.3))))))-1)*1000-(0.622/((101325/($AF$1*611*EXP(17.27*($AB$3/($AB$3+237.3))))))-1)*1000))/(1005*((($AB$1+$AB$2)/2)-$AB$3))))>1,1,1/(1+((2258*((0.622/((101325/(1*611*EXP(17.27*((($AB$1+$AB$2)/2)/((($AB$1+$AB$2)/2)+237.3))))))-1)*1000-(0.622/((101325/($AF$1*611*EXP(17.27*($AB$3/($AB$3+237.3))))))-1)*1000))/(1005*((($AB$1+$AB$2)/2)-$AB$3)))))","v":1},1,1,165,197,260,null,0,0,0,{"$f":"IF(SUM(BC10:BE10)=0,1,0)","v":1}]
[{"$f":"CONCATENATE(B11,C11,D11)","v":"200658"},200,65,8,{"$f":"IF('Vertiga Hybrid'!$J$5=data!$K$20,9.2,IF('Vertiga Hybrid'!$J$5=data!$K$21,11.5,\"\"))","v":9.1999999999999993},0,26,30,39.9,0,1641,1872,3042,0,1,1,1,0,950,1084,1761,0,41,47,76,180,210,304,0.95,0.95,0.95,197,230,333,85,99,143,1.4,"N/A","N/A","N/A",null,0,"N/A","N/A","N/A",null,1,1,1,197,230,333,null,0,0,0,1]
["2005312",200,53,12,{"$f":"IF('Vertiga Hybrid'!$J$5=data!$K$20,13.2,IF('Vertiga Hybrid'!$J$5=data!$K$21,15.8,\"\"))","v":13.2},0,26,30,38.700000000000003,0,2054,2374,2925,0,1,1,1,0,1189,1375,{"$f":"ROUND(M12*POWER((($L$1-$L$2)/LN(($L$1-$L$3)/($L$2-$L$3)))/((75-65)/LN((75-20)/(65-20))),Q12),0)","v":1694},0,51,59,73,230,281,410,0.95,0.95,0.95,252,308,449,108,132,193,2.4,"N/A","N/A","N/A",null,0,"N/A","N/A","N/A",null,1,1,1,252,308,449,null,0,0,0,1]
["2007012",200,70,12,{"$f":"IF('Vertiga Hybrid'!$J$5=data!$K$20,13.2,IF('Vertiga Hybrid'!$J$5=data!$K$21,15.8,\"\"))","v":13.2},0,26,30,40.799999999999997,0,2941,3808,4362,0,1,1,1,0,1703,2205,2526,0,73,95,109,477,578,918,0.95,0.95,0.95,522,633,1006,224,272,433,2.4,"N/A","N/A","N/A",null,0,"N/A","N/A","N/A",null,1,1,1,522,633,1006,null,0,0,0,1]
["2009012",200,90,12,{"$f":"IF('Vertiga Hybrid'!$J$5=data!$K$20,13.2,IF('Vertiga Hybrid'!$J$5=data!$K$21,15.8,\"\"))","v":13.2},0,26,30,42.9,0,3461,4758,5605,0,1,1,1,0,2004,2755,3245,0,86,118,140,717,859,1464,0.95,0.95,0.95,785,941,1604,338,405,690,2.4,"N/A","N/A","N/A",null,0,"N/A","N/A","N/A",null,{"$f":"IF(1/(1+((2258*((0.622/((101325/(1*611*EXP(17.27*((($AB$1+$AB$2)/2)/((($AB$1+$AB$2)/2)+237.3))))))-1)*1000-(0.622/((101325/($AF$1*611*EXP(17.27*($AB$3/($AB$3+237.3))))))-1)*1000))/(1005*((($AB$1+$AB$2)/2)-$AB$3))))>1,1,1/(1+((2258*((0.622/((101325/(1*611*EXP(17.27*((($AB$1+$AB$2)/2)/((($AB$1+$AB$2)/2)+237.3))))))-1)*1000-(0.622/((101325/($AF$1*611*EXP(17.27*($AB$3/($AB$3+237.3))))))-1)*1000))/(1005*((($AB$1+$AB$2)/2)-$AB$3)))))","v":1},1,1,785,941,1604,null,0,0,0,1]
[]
[]
[]
[null,null,null,null,null,null,null,null,null,null,null,"lengte","hoogte","type"]
[null,null,null,null,null,null,null,null,null,null,"geselecteerd"]
[null,null,null,null,null,null,null,null,null,null,"Primo",{"$f":"IF('Vertiga Hybrid'!$L$6=8,41,IF('Vertiga Hybrid'!$L$6=12,53,\"\"))","v":41},200,8]
[null,null,null,null,null,null,null,null,null,null,"Kirei",{"$f":"IF('Vertiga Hybrid'!$L$6=8,52,IF('Vertiga Hybrid'!$L$6=12,70,\"\"))","v":52},null,12]
[null,null,null,null,null,null,null,null,null,null,null,{"$f":"IF('Vertiga Hybrid'!$L$6=8,65,IF('Vertiga Hybrid'!$L$6=12,90,\"\"))","v":65}]
[]
[]
[null,null,null,null,null,null,null,null,null,null,{"$f":"IF($P$38=1,NL!I3,IF($P$38=2,EN!I3,IF($P$38=3,FR!I3,IF($P$38=4,DE!I3,IF($P$38=5,NR!I3,IF($P$38=6,SP!I3,IF($P$38=7,SW!I3,IF($P$38=8,TS!I3,IF($P$38=9,ExtraTaal1!I3,IF($P$38=10,ExtraTaal2!I3,IF($P$38=11,ExtraTaal3!I3,)))))))))))","v":"Copy all data"},null,null,null,null,"Nederlands"]
[null,null,null,null,null,null,null,null,null,null,{"$f":"IF($P$38=1,NL!I4,IF($P$38=2,EN!I4,IF($P$38=3,FR!I4,IF($P$38=4,DE!I4,IF($P$38=5,NR!I4,IF($P$38=6,SP!I4,IF($P$38=7,SW!I4,IF($P$38=8,TS!I4,IF($P$38=9,ExtraTaal1!I4,IF($P$38=10,ExtraTaal2!I4,IF($P$38=11,ExtraTaal3!I4,)))))))))))","v":"SI-units"},null,null,null,null,"English"]
[null,null,null,null,null,null,null,null,null,null,{"$f":"IF($P$38=1,NL!I5,IF($P$38=2,EN!I5,IF($P$38=3,FR!I5,IF($P$38=4,DE!I5,IF($P$38=5,NR!I5,IF($P$38=6,SP!I5,IF($P$38=7,SW!I5,IF($P$38=8,TS!I5,IF($P$38=9,ExtraTaal1!I5,IF($P$38=10,ExtraTaal2!I5,IF($P$38=11,ExtraTaal3!I5,)))))))))))","v":"Imperial-units"},null,null,null,null,"Français"]
[null,null,null,null,null,null,null,null,null,null,null,null,null,null,null,"Deutsch"]
[null,null,null,null,null,null,null,null,null,null,null,null,null,null,null,"Norsk"]
[null,null,null,null,null,null,null,null,null,null,null,null,null,null,null,"Español"]
[null,null,null,null,null,null,null,null,null,null,null,null,null,null,null,"Svenska",null,1]
[null,null,null,null,null,null,null,null,null,null,null,null,null,null,null,"Čeština"]
[null,null,null,null,null,null,null,null,null,null,null,null,null,null,null,"ExtraTaal1"]
[null,null,null,null,null,null,null,null,null,null,null,null,null,null,null,"ExtraTaal2"]
[null,null,null,null,null,null,null,null,null,null,null,null,null,null,null,"ExtraTaal3"]
[]
[]
[null,null,null,null,null,null,null,null,null,null,null,null,null,null,null,{"$f":"IF('Vertiga Hybrid'!J4=data!$P$25,1,IF('Vertiga Hybrid'!J4=data!$P$26,2,IF('Vertiga Hybrid'!J4=data!$P$27,4,IF('Vertiga Hybrid'!J4=data!$P$28,3,IF('Vertiga Hybrid'!J4=data!$P$29,5,IF('Vertiga Hybrid'!J4=data!$P$30,6,IF('Vertiga Hybrid'!J4=data!$P$31,7,IF('Vertiga Hybrid'!J4=data!$P$32,8,IF('Vertiga Hybrid'!J4=data!$P$33,9,IF('Vertiga Hybrid'!J4=data!$P$34,10,IF('Vertiga Hybrid'!J4=data!$P$35,11,)))))))))))","v":2}]

{"sheet":"NL","index":2,"n_rows":22,"n_cols":10,"rows_kept":22,"cut":false,"hidden":true,"merged":[[15,0,17,0],[0,1,0,5],[8,4,8,6],[9,4,9,6],[10,4,10,6],[12,2,12,3],[12,4,12,5],[12,9,13,9],[12,8,13,8],[12,6,13,6],[12,7,13,7],[14,0,14,1]]}
[null,"Selectiontool Strada Hybrid"]
[]
[null,"Lengte",null,"mm","Invulformulier","Statisch toestel","rel. vocht.","Unit","Kopieer alle data"]
[null,"Hoogte",null,{"$f":"D3","v":"mm"},"Uitvoering","Hybrid toestel","Eenheidsstelsel","DBH set","SI-eenheden"]
[null,"Type",null,null,"Temperaturen","DBH rail type","Toestel",null,"Imperiale-eenheden"]
[null,"Diepte",null,{"$f":"D3","v":"mm"},"Indien de ventilatoren uitgeschakeld zijn, is de afgifte een indicatieve waarde.","Waterzijdig drukverlies"]
[]
[null,"Verwarmen:",null,null,null,null,"Koelen:"]
[null,"Water aanvoer",null,null,{"$f":"B9","v":"Water aanvoer"},null,null,null,{"$f":"D9","v":0}]
[null,"Water retour",null,null,{"$f":"B10","v":"Water retour"},null,null,null,{"$f":"D9","v":0}]
[null,"Ruimte (droge bol)",null,null,{"$f":"B11","v":"Ruimte (droge bol)"},null,null,null,{"$f":"D9","v":0}]
[]
[null,null,{"$f":"CONCATENATE(B8,\" \",C9,\"/\",C10,\"/\",C11)","v":"Verwarmen: //"},null,{"$f":"CONCATENATE(G8,\" \",H9,\"/\",H10,\"/\",H11)","v":"Koelen: //"},null,"Watervolume","Elektrisch verbruik [W]","Geluidsdrukniveau [dB(A)]****","Geluidsvermogen [dB(A)]****"]
[null,null,"Verwarmvermogen","Waterdebiet","Koelvermogen",{"$f":"D14","v":"Waterdebiet"}]
["Statisch (indicatieve waarde)"]
["EN16430","Ventilatorsnelheid "]
[null,"Ventilatorsnelheid 2"]
[null,"Ventilatorsnelheid 3"]
[null,"Stuurspanning [v]"]
["*","Koelvermogen is berekend volgens EN16430 met de ventilatoren naar boven blazend voor alle types."]
["**","Wanneer het watervolume in gallons wordt gegeven, zijn dit imperial gallons."]
["***","Geluidsvermogen volgens ISO 3741:2010, Voor het geluidsdrukniveau is er een aangenomen kamerdemping van 8 dB(A)."]

{"sheet":"EN","index":3,"n_rows":22,"n_cols":10,"rows_kept":22,"cut":false,"hidden":true,"merged":[[15,0,17,0],[0,1,0,5],[8,4,8,6],[9,4,9,6],[10,4,10,6],[12,2,12,3],[12,4,12,5],[12,9,13,9],[12,8,13,8],[12,7,13,7],[12,6,13,6],[14,0,14,1]]}
[null,"Selectiontool Strada Hybrid"]
[]
[null,"Length",null,"mm","Formulary","Static device","rel. humid.","Unit","Copy all data"]
[null,"Heigth",null,{"$f":"D3","v":"mm"},"Version","Hybrid device","Unit conversion","DBH set","SI-units"]
[null,"Type",null,null,"Temperatures","DBH rail type","Device",null,"Imperial-units"]
[null,"Depth",null,{"$f":"D3","v":"mm"},"If the fans are switched off, the output is an indicative value.","Water side pressure loss "]
[]
[null,"Heating:",null,null,null,null,"Cooling:"]
[null,"Supply water",null,null,{"$f":"B9","v":"Supply water"},null,null,null,{"$f":"D9","v":0}]
[null,"Return water",null,null,{"$f":"B10","v":"Return water"},null,null,null,{"$f":"D9","v":0}]
[null,"Entering air (dry bulb)",null,null,{"$f":"B11","v":"Entering air (dry bulb)"},null,null,null,{"$f":"D9","v":0}]
[]
[null,null,{"$f":"CONCATENATE(B8,\" \",C9,\"/\",C10,\"/\",C11)","v":"Heating: //"},null,{"$f":"CONCATENATE(G8,\" \",H9,\"/\",H10,\"/\",H11)","v":"Cooling: //"},null,"Water volume","Electrical consumption [W]","Sound pressure level [dB(A)]****","Sound power [dB(A)]****"]
[null,null,"Heating capacity","Water flow","Cooling capacity",{"$f":"D14","v":"Water flow"}]
["Fans off (indicative value)"]
["EN16430","Fan speed"]
[null,"Fan speed selection 2"]
[null,"Fan speed selection 3"]
[null,"Fan voltage [V]"]
["*","Cooling power is calcullated according EN16430 with fans blowing up for all heights."]
["**","When the water volume is given in gallons, the units are specifically imperial gallons."]
["***","Soundpower according to ISO 3741:2010, sound pressure level with assumed room damping of 8 dB(A)."]

{"sheet":"FR","index":4,"n_rows":22,"n_cols":10,"rows_kept":22,"cut":false,"hidden":true,"merged":[[15,0,17,0],[0,1,0,5],[8,4,8,6],[9,4,9,6],[10,4,10,6],[12,2,12,3],[12,4,12,5],[12,9,13,9],[12,8,13,8],[12,7,13,7],[12,6,13,6],[14,0,14,1]]}
[null,"Selectiontool Strada Hybrid"]
[]
[null,"Longeur",null,"mm","Formulaire","Appareil statique","hum. rel.","Unité","Copier toutes des données"]
[null,"Hauteur",null,{"$f":"D3","v":"mm"},"Version","Appareil Hybrid","Système unitaire","DBH set","Unités-SI"]
[null,"Type",null,null,"Températures","DBH rail type","Appareil",null,"Unités-Impériales"]
[null,"Profondeur",null,{"$f":"D3","v":"mm"},"Si les ventilateurs sont éteints, la sortie est une valeur indicative.","Perte de charge"]
[]
[null,"Chauffer:",null,null,null,null,"Refroidir:"]
[null,"Entrée de l'eau",null,null,{"$f":"B9","v":"Entrée de l'eau"},null,null,null,{"$f":"D9","v":0}]
[null,"Retour de l'eau",null,null,{"$f":"B10","v":"Retour de l'eau"},null,null,null,{"$f":"D9","v":0}]
[null,"Ambiante (bulbe sec)",null,null,{"$f":"B11","v":"Ambiante (bulbe sec)"},null,null,null,{"$f":"D9","v":0}]
[]
[null,null,{"$f":"CONCATENATE(B8,\" \",C9,\"/\",C10,\"/\",C11)","v":"Chauffer: //"},null,{"$f":"CONCATENATE(G8,\" \",H9,\"/\",H10,\"/\",H11)","v":"Refroidir: //"},null,"Volume d'eau","Puissance absorbée elec. [W]","Pression sonore [dB(A)]****","Puissance sonore [dB(A)]****"]
[null,null,"Puissance de chauffer","Débit d'eau","Puissance de refroidir",{"$f":"D14","v":"Débit d'eau"}]
["Ventilateur éteint (indicative)"]
["EN16430","Vitesse ventilateur "]
[null,"Vitesse du ventilateur 2"]
[null,"Vitesse du ventilateur 3"]
[null,"Tension ventilateur [V]"]
["*","La puissance de refroidissement est calculée selon EN 16430 avec des ventilateurs qui soufflent pour toutes les hauteurs."]
["**","Lorsque le volume d'eau est donné en gallons, ce sont des gallons impérial."]
["***","Puissance acoustique selon ISO 3741: 2010, niveau de pression acoustique avec un amortissement de la pièce supposé de 8 dB(A)."]

{"sheet":"DE","index":5,"n_rows":22,"n_cols":10,"rows_kept":22,"cut":false,"hidden":true,"merged":[[15,0,17,0],[0,1,0,5],[8,4,8,6],[9,4,9,6],[10,4,10,6],[12,2,12,3],[12,4,12,5],[12,9,13,9],[12,8,13,8],[12,7,13,7],[12,6,13,6],[14,0,14,1]]}
[null,"Selectiontool Strada Hybrid"]
[]
[null,"Länge",null,"mm","Eingabefelder","Statisches Gerät","rel. Luftf.","Unit","Kopieren Sie alle daten"]
[null,"Höhe",null,{"$f":"D3","v":"mm"},"Ausführung","Hybrid Gerät","Einheiten","DBH set","SI-einheiten"]
[null,"Typ",null,null,"Temperaturen","DBH rail typ","Gerät",null,"Imperiale-einheiten"]
[null,"Tiefe",11.5,{"$f":"D3","v":"mm"},"Wenn die Lüfter ausgeschaltet sind, ist der Ausgang ein Richtwert.","zug. wassers. Druckverlust"]
[]
[null,"Heizen:",null,null,null,null,"Kühlen:"]
[null,"Vorlauf wasser",null,null,{"$f":"B9","v":"Vorlauf wasser"},null,null,null,{"$f":"D9","v":0}]
[null,"Rücklauf wasser",null,null,{"$f":"B10","v":"Rücklauf wasser"},null,null,null,{"$f":"D9","v":0}]
[null,"Raum (trocken)",null,null,{"$f":"B11","v":"Raum (trocken)"},null,null,null,{"$f":"D9","v":0}]
[]
[null,null,{"$f":"CONCATENATE(B8,\" \",C9,\"/\",C10,\"/\",C11)","v":"Heizen: //"},null,{"$f":"CONCATENATE(G8,\" \",H9,\"/\",H10,\"/\",H11)","v":"Kühlen: //"},null,"Wasservolumen","Elektr. Leistung [W]","Schalldruckpegel [dB(A)]****","Schallleistungspegel [dB(A)]****"]
[null,null,"Heizleistung","Heizmittelstrom","Kühlleistung","Kühlmittelstrom"]
["Lüfter aus (richtwert)"]
["EN16430","Auslegungsstufe "]
[null,"Auslegungsstufe 2"]
[null,"Auslegungsstufe 3"]
[null,"Lufterspannung [V]"]
["*","Die Kühlleistung wird nach EN 16430 berechnet, wobei die Lüfter für alle Höhen hochgehen."]
["**","Wenn das Wasservolumen in Gallonen angegeben ist, sind dies imperiale Gallonen."]
["***","Schallleistung nach ISO 3741: 2010, Schalldruckpegel bei angenommener Raumdämpfung von 8 dB(A)."]

{"sheet":"NR","index":6,"n_rows":22,"n_cols":10,"rows_kept":22,"cut":false,"hidden":true,"merged":[[12,7,13,7],[12,8,13,8],[12,9,13,9],[14,0,14,1],[15,0,17,0],[0,1,0,5],[8,4,8,6],[9,4,9,6],[10,4,10,6],[12,2,12,3],[12,4,12,5],[12,6,13,6]]}
[null,"Selectiontool Strada Hybrid"]
[]
[null,"Lengde",null,"mm","Inngangsskjema","Statisk modell","rel. fuktighet","Unit","Kopier alle data"]
[null,"Høyde",null,{"$f":"D3","v":"mm"},"Versjon","Hybrid modell","Enhetssystem","DBH set","SI-enheter"]
[null,"Type",null,null,"Temperaturer","DBH rail type","Modell",null,"Imperiale-enheter"]
[null,"Bredde",null,{"$f":"D3","v":"mm"},"Hvis viftene er slått av, er utgangen en indikativ verdi.","Trykktap"]
[]
[null,"Varme:",null,null,null,null,"Kjøling:"]
[null,"Tur vann",null,null,{"$f":"B9","v":"Tur vann"},null,null,null,{"$f":"D9","v":0}]
[null,"Retur vann",null,null,{"$f":"B10","v":"Retur vann"},null,null,null,{"$f":"D9","v":0}]
[null,"Rom (tørr pære)",null,null,{"$f":"B11","v":"Rom (tørr pære)"},null,null,null,{"$f":"D9","v":0}]
[]
[null,null,{"$f":"CONCATENATE(B8,\" \",C9,\"/\",C10,\"/\",C11)","v":"Varme: //"},null,{"$f":"CONCATENATE(G8,\" \",H9,\"/\",H10,\"/\",H11)","v":"Kjøling: //"},null,"Vannvolum","Elektrisk effekt [W]","Lydtrykk [dB(A)]****","Lydeffekt [dB(A)]****"]
[null,null,"Varme effekt","Vannmengde","Kjøle effekt",{"$f":"D14","v":"Vannmengde"}]
["Lüfter aus (richtwert)"]
["EN16430","Styresignal"]
[null,"Auslegungsstufe 2"]
[null,"Auslegungsstufe 3"]
[null,"Viftespenning [V]"]
["*","Kjølekapasitet beregnes i henhold til EN16430 med viftene som blåser oppover for alle typer."]
["**","Når vannvolumet er gitt i gallon, er dette imperial gallons."]
["***","Lydeffekt i henhold til ISO 3741: 2010. For lydtrykknivået er det en antatt romdemping på 8 dB (A)."]

{"sheet":"SP","index":7,"n_rows":22,"n_cols":10,"rows_kept":22,"cut":false,"hidden":true,"merged":[[12,7,13,7],[12,8,13,8],[12,9,13,9],[14,0,14,1],[15,0,17,0],[0,1,0,5],[8,4,8,6],[9,4,9,6],[10,4,10,6],[12,2,12,3],[12,4,12,5],[12,6,13,6]]}
[null,"Selectiontool Strada Hybrid"]
[]
[null,"Longitud",null,"mm","Formulary","Dispositivo estático","Hum. Relativa","Unit","Copiar todos los datos"]
[null,"Altura",null,{"$f":"D3","v":"mm"},"Versión","Dispositivo Hybrid","Convers. de unidades","DBH set","Unidades-SI"]
[null,"Tipo",null,null,"Temperaturas","tipo de riel DBH","Despositivo",null,"Unidades-Imperial"]
[null,"Profund.",null,{"$f":"D3","v":"mm"},"La velocidad del ventilador en \"0\" tiene una emisión indicativa.","Pérdida de carga del agua"]
[]
[null,"Calefacción:",null,null,null,null,"Enfriamiento:"]
[null,"Agua impulsión",null,null,{"$f":"B9","v":"Agua impulsión"},null,null,null,{"$f":"D9","v":0}]
[null,"Agua retorno",null,null,{"$f":"B10","v":"Agua retorno"},null,null,null,{"$f":"D9","v":0}]
[null,"Ambiente (bulbo seco)",null,null,{"$f":"B11","v":"Ambiente (bulbo seco)"},null,null,null,{"$f":"D9","v":0}]
[]
[null,null,{"$f":"CONCATENATE(B8,\" \",C9,\"/\",C10,\"/\",C11)","v":"Calefacción: //"},null,{"$f":"CONCATENATE(G8,\" \",H9,\"/\",H10,\"/\",H11)","v":"Enfriamiento: //"},null,"Volumen de agua","Potencia eléctrica absorbida [W]","Presión sonora [dB(A)]****","Potencia sonora [dB(A)]****"]
[null,null,"Emisión calefacción","Caudal de agua, calefacción","Emisión sensible Frío",{"$f":"D14","v":"Caudal de agua, calefacción"}]
["Fans off (indicative value)"]
["EN16430","Velocidad del ventilador"]
[null,"Fan speed selection 2"]
[null,"Fan speed selection 3"]
[null," Voltaje control [V]"]
["*","La potencia de enfriamiento se calcula según la norma EN 16430 con ventiladores de todas las alturas."]
["**","Cuando el volumen de agua se da en galones, las unidades son específicamente galones imperiales."]
["***","Potencia sonora según ISO 3741: 2010, nivel de presión acústica con una amortiguación ambiental supuesta de 8 dB (A)."]

{"sheet":"SW","index":8,"n_rows":22,"n_cols":10,"rows_kept":22,"cut":false,"hidden":true,"merged":[[0,1,0,5],[8,4,8,6],[9,4,9,6],[10,4,10,6],[12,2,12,3],[12,4,12,5],[12,6,13,6],[12,7,13,7],[12,8,13,8],[12,9,13,9],[14,0,14,1],[15,0,17,0]]}
[null,"Selectiontool Strada Hybrid"]
[]
[null,"Längd",null,"mm","Inngangsskjema","Statisk modell","rel. Fuktighet","Unit","Kopiera all data"]
[null,"Höjd",null,{"$f":"D3","v":"mm"},"Storlek","Hybrid modell","Enhetssystem","DBH set","SI-enheter"]
[null,"Typ",null,null,"Temperaturer","DBH rail typ","Modell",null,"Imperiella-enheter"]
[null,"Djup",null,{"$f":"D3","v":"mm"},"Om fläktarna är avstängda är utgången ett indikationsvärde.","Tryckfall, vatten"]
[]
[null,"Värme:",null,null,null,null,"Kyla:"]
[null,"Tillopp",null,null,{"$f":"B9","v":"Tillopp"},null,null,null,{"$f":"D9","v":0}]
[null,"Retur",null,null,{"$f":"B10","v":"Retur"},null,null,null,{"$f":"D9","v":0}]
[null,"Rum (torr)",null,null,{"$f":"B11","v":"Rum (torr)"},null,null,null,{"$f":"D9","v":0}]
[]
[null,null,{"$f":"CONCATENATE(B8,\" \",C9,\"/\",C10,\"/\",C11)","v":"Värme: //"},null,{"$f":"CONCATENATE(G8,\" \",H9,\"/\",H10,\"/\",H11)","v":"Kyla: //"},null,"Vattenvolym","Effektförbrukning [W]","Ljudtryck [dB(A)]****","Ljudeffekt [dB(A)]****"]
[null,null,"Effekt","Vattenflöde","Kyleffekt",{"$f":"D14","v":"Vattenflöde"}]
["Fans off (indicative value)"]
["EN16430","Fläkthastighet"]
[null,"Fan speed selection 2"]
[null,"Fan speed selection 3"]
[null,"Spänning, Fläkt [V]"]
["*","Kyleffekt är beräknad enligt EN16430 med fläktar blåsandes i riktning uppåt för alla höjder"]
["**","När vattenvolymen är given i gallon avser det Imperiella gallon."]
["***","Ljudeffekt enligt ISO 3741:2010 ljudtryck med antagen ljudreduktion från rummet på 8 dB(A)"]

{"sheet":"TS","index":9,"n_rows":22,"n_cols":10,"rows_kept":22,"cut":false,"hidden":true,"merged":[[0,1,0,5],[8,4,8,6],[9,4,9,6],[10,4,10,6],[12,2,12,3],[12,4,12,5],[12,6,13,6],[12,7,13,7],[12,8,13,8],[12,9,13,9],[14,0,14,1],[15,0,17,0]]}
[null,"Selectiontool Strada Hybrid"]
[]
[null,"Délka",null,"mm","Formulary","Statická jednotka","Relativní vlhkost","Jednotka","Kopírovat všechna data"]
[null,"Výška",null,{"$f":"D3","v":"mm"},"Verze","Hybridní jednotka","Převod jednotek","DBH sada","Mezinárodní (Sl)"]
[null,"Typ",null,null,"Teploty","DBH rail typ","Device",null,"Imperiální"]
[null,"Hloubka",null,{"$f":"D3","v":"mm"},"Pokud jsou ventilátory vypnuté, je výkon pouze orientační.","Tlaková ztráta"]
[]
[null,"Topení:",null,null,null,null,"Chlazení:"]
[null,"Voda na přívodu",null,null,{"$f":"B9","v":"Voda na přívodu"}]
[null,"Voda na zpátečce",null,null,{"$f":"B10","v":"Voda na zpátečce"}]
[null,"\"Suchá\" teplota vzduchu",null,null,{"$f":"B11","v":"\"Suchá\" teplota vzduchu"}]
[]
[null,null,{"$f":"CONCATENATE(B8,\" \",C9,\"/\",C10,\"/\",C11)","v":"Topení: //"},null,{"$f":"CONCATENATE(G8,\" \",H9,\"/\",H10,\"/\",H11)","v":"Chlazení: //"},null,"Objem vody","Elektrický výkon [W]","Akustický tlak [dB(A)]****","Akustický výkon [dB(A)]****"]
[null,null,"Výkon Topení","Průtok vody","Výkon Chlazení","Průtok vody"]
["Fans off (indicative value)"]
["EN16430","Rychlost otáček ventilátoru"]
[null,"Fan speed selection 2"]
[null,"Fan speed selection 3"]
[null,"Napětí ventilárotu [V]"]
["*","Chladicí výkon vypočítán podle EN 16430  s ventilátory, které u všech typů - výšek foukají nahoru."]
["**"]
["***","Akustický výkon podle ISO 3741: 2010, hladina akustického tlaku s předpokládaným útlumem místnosti o 8 dB (A)."]

{"sheet":"ExtraTaal1","index":10,"n_rows":22,"n_cols":10,"rows_kept":22,"cut":false,"hidden":true,"merged":[[0,1,0,5],[8,4,8,6],[9,4,9,6],[10,4,10,6],[12,2,12,3],[12,4,12,5],[12,6,13,6],[12,7,13,7],[12,8,13,8],[12,9,13,9],[14,0,14,1],[15,0,17,0]]}
[null,"Selectiontool Strada Hybrid"]
[]
[null,"Length",null,"mm","Formulary","Static device","rel. humid.","Unit","Copy all data"]
[null,"Heigth",null,{"$f":"D3","v":"mm"},"Version","Hybrid device","Unit conversion","DBH set","SI-units"]
[null,"Type",null,null,"Temperatures","DBH rail type","Device",null,"Imperial-units"]
[null,"Depth",null,{"$f":"D3","v":"mm"},"If the fans are switched off, the output is an indicative value.","Water side pressure loss "]
[]
[null,"Heating:",null,null,null,null,"Cooling:"]
[null,"Supply water",null,null,{"$f":"B9","v":"Supply water"},null,null,null,{"$f":"D9","v":0}]
[null,"Return water",null,null,{"$f":"B10","v":"Return water"},null,null,null,{"$f":"D9","v":0}]
[null,"Entering air (dry bulb)",null,null,{"$f":"B11","v":"Entering air (dry bulb)"},null,null,null,{"$f":"D9","v":0}]
[]
[null,null,{"$f":"CONCATENATE(B8,\" \",C9,\"/\",C10,\"/\",C11)","v":"Heating: //"},null,{"$f":"CONCATENATE(G8,\" \",H9,\"/\",H10,\"/\",H11)","v":"Cooling: //"},null,"Water volume","Electrical consumption [W]","Sound pressure level [dB(A)]****","Sound power [dB(A)]****"]
[null,null,"Heating capacity","Water flow","Cooling capacity",{"$f":"D14","v":"Water flow"}]
["Fans off (indicative value)"]
["EN16430","Fan speed"]
[null,"Fan speed selection 2"]
[null,"Fan speed selection 3"]
[null,"Fan voltage [V]"]
["*","Cooling power is calcullated according EN16430 with fans blowing up for all heights."]
["**","When the water volume is given in gallons, the units are specifically imperial gallons."]
["***","Soundpower according to ISO 3741:2010, sound pressure level with assumed room damping of 8 dB(A)."]

{"sheet":"ExtraTaal2","index":11,"n_rows":22,"n_cols":10,"rows_kept":22,"cut":false,"hidden":true,"merged":[[0,1,0,5],[8,4,8,6],[9,4,9,6],[10,4,10,6],[12,2,12,3],[12,4,12,5],[12,6,13,6],[12,7,13,7],[12,8,13,8],[12,9,13,9],[14,0,14,1],[15,0,17,0]]}
[null,"Selectiontool Strada Hybrid"]
[]
[null,"Length",null,"mm","Formulary","Static device","rel. humid.","Unit","Copy all data"]
[null,"Heigth",null,{"$f":"D3","v":"mm"},"Version","Hybrid device","Unit conversion","DBH set","SI-units"]
[null,"Type",null,null,"Temperatures","DBH rail type","Device",null,"Imperial-units"]
[null,"Depth",null,{"$f":"D3","v":"mm"},"If the fans are switched off, the output is an indicative value.","Water side pressure loss "]
[]
[null,"Heating:",null,null,null,null,"Cooling:"]
[null,"Supply water",null,null,{"$f":"B9","v":"Supply water"},null,null,null,{"$f":"D9","v":0}]
[null,"Return water",null,null,{"$f":"B10","v":"Return water"},null,null,null,{"$f":"D9","v":0}]
[null,"Entering air (dry bulb)",null,null,{"$f":"B11","v":"Entering air (dry bulb)"},null,null,null,{"$f":"D9","v":0}]
[]
[null,null,{"$f":"CONCATENATE(B8,\" \",C9,\"/\",C10,\"/\",C11)","v":"Heating: //"},null,{"$f":"CONCATENATE(G8,\" \",H9,\"/\",H10,\"/\",H11)","v":"Cooling: //"},null,"Water volume","Electrical consumption [W]","Sound pressure level [dB(A)]****","Sound power [dB(A)]****"]
[null,null,"Heating capacity","Water flow","Cooling capacity",{"$f":"D14","v":"Water flow"}]
["Fans off (indicative value)"]
["EN16430","Fan speed"]
[null,"Fan speed selection 2"]
[null,"Fan speed selection 3"]
[null,"Fan voltage [V]"]
["*","Cooling power is calcullated according EN16430 with fans blowing up for all heights."]
["**","When the water volume is given in gallons, the units are specifically imperial gallons."]
["***","Soundpower according to ISO 3741:2010, sound pressure level with assumed room damping of 8 dB(A)."]

{"sheet":"ExtraTaal3","index":12,"n_rows":22,"n_cols":10,"rows_kept":22,"cut":false,"hidden":true,"merged":[[0,1,0,5],[8,4,8,6],[9,4,9,6],[10,4,10,6],[12,2,12,3],[12,4,12,5],[12,6,13,6],[12,7,13,7],[12,8,13,8],[12,9,13,9],[14,0,14,1],[15,0,17,0]]}
[null,"Selectiontool Strada Hybrid"]
[]
[null,"Length",null,"mm","Formulary","Static device","rel. humid.","Unit","Copy all data"]
[null,"Heigth",null,{"$f":"D3","v":"mm"},"Version","Hybrid device","Unit conversion","DBH set","SI-units"]
[null,"Type",null,null,"Temperatures","DBH rail type","Device",null,"Imperial-units"]
[null,"Depth",null,{"$f":"D3","v":"mm"},"If the fans are switched off, the output is an indicative value.","Water side pressure loss "]
[]
[null,"Heating:",null,null,null,null,"Cooling:"]
[null,"Supply water",null,null,{"$f":"B9","v":"Supply water"},null,null,null,{"$f":"D9","v":0}]
[null,"Return water",null,null,{"$f":"B10","v":"Return water"},null,null,null,{"$f":"D9","v":0}]
[null,"Entering air (dry bulb)",null,null,{"$f":"B11","v":"Entering air (dry bulb)"},null,null,null,{"$f":"D9","v":0}]
[]
[null,null,{"$f":"CONCATENATE(B8,\" \",C9,\"/\",C10,\"/\",C11)","v":"Heating: //"},null,{"$f":"CONCATENATE(G8,\" \",H9,\"/\",H10,\"/\",H11)","v":"Cooling: //"},null,"Water volume","Electrical consumption [W]","Sound pressure level [dB(A)]****","Sound power [dB(A)]****"]
[null,null,"Heating capacity","Water flow","Cooling capacity",{"$f":"D14","v":"Water flow"}]
["Fans off (indicative value)"]
["EN16430","Fan speed"]
[null,"Fan speed selection 2"]
[null,"Fan speed selection 3"]
[null,"Fan voltage [V]"]
["*","Cooling power is calcullated according EN16430 with fans blowing up for all heights."]
["**","When the water volume is given in gallons, the units are specifically imperial gallons."]
["***","Soundpower according to ISO 3741:2010, sound pressure level with assumed room damping of 8 dB(A)."]